Target
Adenosine receptor A1
Ligand
BDBM82010
Substrate
Meas. Tech.
ChEBML_28998
Ki
0.630000±n/a nM
Citation
 Erickson, RHHiner, RNFeeney, SWBlake, PRRzeszotarski, WJHicks, RPCostello, DGAbreu, ME 1,3,8-trisubstituted xanthines. Effects of substitution pattern upon adenosine receptor A1/A2 affinity. J Med Chem 34:1431-5 (1991)  
Target
Name:
Adenosine receptor A1
Synonyms:
AA1R_RAT ADENOSINE A1 high Adenosine A1 receptor (A1) Adenosine receptors A1 | Adora1
Type:
Protein
Mol. Mass.:
36704.13
Organism:
Rattus norvegicus (rat)
Description:
Residue:
326
  
Inhibitor
Name:
BDBM82010
Synonyms:
1,3-Dipropyl-8-(4-hydroxyphenyl)xanthine CHEMBL27155
Type:
Emp. Form.:
C17H20N4O3
Mol. Mass.:
328.3657
SMILES:
CCCn1c2nc([nH]c2c(=O)n(CCC)c1=O)-c1ccc(O)cc1
: