Target
Adenosine receptor A1
Ligand
BDBM50011833
Substrate
Meas. Tech.
ChEBML_28998
Ki
4.5±n/a nM
Citation
 Erickson, RHHiner, RNFeeney, SWBlake, PRRzeszotarski, WJHicks, RPCostello, DGAbreu, ME 1,3,8-trisubstituted xanthines. Effects of substitution pattern upon adenosine receptor A1/A2 affinity. J Med Chem 34:1431-5 (1991)  
Target
Name:
Adenosine receptor A1
Synonyms:
AA1R_RAT ADENOSINE A1 high Adenosine A1 receptor (A1) Adenosine receptors A1 | Adora1
Type:
Protein
Mol. Mass.:
36704.13
Organism:
Rattus norvegicus (rat)
Description:
Residue:
326
  
Inhibitor
Name:
BDBM50011833
Synonyms:
4-(2,6-Dioxo-1,3-dipropyl-2,3,6,7-tetrahydro-1H-purin-8-yl)-benzonitrile | CHEMBL33673
Type:
Small organic molecule
Emp. Form.:
C18H19N5O2
Mol. Mass.:
337.3758
SMILES:
CCCn1c2nc([nH]c2c(=O)n(CCC)c1=O)-c1ccc(cc1)C#N
: