Target
Adenosine receptor A1
Ligand
BDBM50011837
Substrate
Meas. Tech.
ChEMBL_28991 (CHEMBL645015)
Ki
73±n/a nM
Citation
 Erickson, RHHiner, RNFeeney, SWBlake, PRRzeszotarski, WJHicks, RPCostello, DGAbreu, ME 1,3,8-trisubstituted xanthines. Effects of substitution pattern upon adenosine receptor A1/A2 affinity. J Med Chem 34:1431-5 (1991)  
Target
Name:
Adenosine receptor A1
Synonyms:
AA1R_RAT ADENOSINE A1 high Adenosine A1 receptor (A1) Adenosine receptors A1 | Adora1
Type:
Protein
Mol. Mass.:
36704.13
Organism:
Rattus norvegicus (rat)
Description:
Residue:
326
  
Inhibitor
Name:
BDBM50011837
Synonyms:
1-Methyl-3-propyl-8-pyridin-3-yl-3,7-dihydro-purine-2,6-dione | CHEMBL284598
Type:
Small organic molecule
Emp. Form.:
C14H15N5O2
Mol. Mass.:
285.3012
SMILES:
CCCn1c2nc([nH]c2c(=O)n(C)c1=O)-c1cccnc1
: