Target
Adenosine receptor A1
Ligand
BDBM50011839
Substrate
Meas. Tech.
ChEBML_28998
Ki
5±n/a nM
Citation
 Erickson, RHHiner, RNFeeney, SWBlake, PRRzeszotarski, WJHicks, RPCostello, DGAbreu, ME 1,3,8-trisubstituted xanthines. Effects of substitution pattern upon adenosine receptor A1/A2 affinity. J Med Chem 34:1431-5 (1991)  
Target
Name:
Adenosine receptor A1
Synonyms:
AA1R_RAT ADENOSINE A1 high Adenosine A1 receptor (A1) Adenosine receptors A1 | Adora1
Type:
Protein
Mol. Mass.:
36704.13
Organism:
Rattus norvegicus (rat)
Description:
Residue:
326
  
Inhibitor
Name:
BDBM50011839
Synonyms:
8-Cyclohexyl-3-methyl-1-propyl-3,7-dihydro-purine-2,6-dione | CHEMBL285074
Type:
Small organic molecule
Emp. Form.:
C15H22N4O2
Mol. Mass.:
290.3608
SMILES:
CCCn1c(=O)n(C)c2nc([nH]c2c1=O)C1CCCCC1
: