Target
Adenosine receptor A1
Ligand
BDBM50011843
Substrate
Meas. Tech.
ChEMBL_28991 (CHEMBL645015)
Ki
6.4±n/a nM
Citation
 Erickson, RHHiner, RNFeeney, SWBlake, PRRzeszotarski, WJHicks, RPCostello, DGAbreu, ME 1,3,8-trisubstituted xanthines. Effects of substitution pattern upon adenosine receptor A1/A2 affinity. J Med Chem 34:1431-5 (1991)  
Target
Name:
Adenosine receptor A1
Synonyms:
AA1R_RAT ADENOSINE A1 high Adenosine A1 receptor (A1) Adenosine receptors A1 | Adora1
Type:
Protein
Mol. Mass.:
36704.13
Organism:
Rattus norvegicus (rat)
Description:
Residue:
326
  
Inhibitor
Name:
BDBM50011843
Synonyms:
3-Methyl-1-propyl-8-thiophen-3-yl-3,7-dihydro-purine-2,6-dione | CHEMBL33169
Type:
Small organic molecule
Emp. Form.:
C13H14N4O2S
Mol. Mass.:
290.341
SMILES:
CCCn1c(=O)n(C)c2nc([nH]c2c1=O)-c1ccsc1
: