Target
Adenosine receptor A1
Ligand
BDBM50011838
Substrate
Meas. Tech.
ChEBML_28998
Ki
1.3±n/a nM
Citation
 Erickson, RHHiner, RNFeeney, SWBlake, PRRzeszotarski, WJHicks, RPCostello, DGAbreu, ME 1,3,8-trisubstituted xanthines. Effects of substitution pattern upon adenosine receptor A1/A2 affinity. J Med Chem 34:1431-5 (1991)  
Target
Name:
Adenosine receptor A1
Synonyms:
AA1R_RAT ADENOSINE A1 high Adenosine A1 receptor (A1) Adenosine receptors A1 | Adora1
Type:
Protein
Mol. Mass.:
36704.13
Organism:
Rattus norvegicus (rat)
Description:
Residue:
326
  
Inhibitor
Name:
BDBM50011838
Synonyms:
8-(4-Hydroxy-phenyl)-3-methyl-1-propyl-3,7-dihydro-purine-2,6-dione | CHEMBL32253
Type:
Small organic molecule
Emp. Form.:
C15H16N4O3
Mol. Mass.:
300.3125
SMILES:
CCCn1c(=O)n(C)c2nc([nH]c2c1=O)-c1ccc(O)cc1
: