Target
Adenosine receptor A2a/A2b
Ligand
BDBM50011844
Substrate
Meas. Tech.
ChEMBL_30570 (CHEMBL649882)
Ki
254±n/a nM
Citation
 Erickson, RHHiner, RNFeeney, SWBlake, PRRzeszotarski, WJHicks, RPCostello, DGAbreu, ME 1,3,8-trisubstituted xanthines. Effects of substitution pattern upon adenosine receptor A1/A2 affinity. J Med Chem 34:1431-5 (1991)  
Target
Name:
Adenosine receptor A2a/A2b
Synonyms:
Adenosine A2 receptor
Type:
Mol. Mass.:
Description:
ASSAY_ID of ChEMBL is 30560
Components:
This complex has 2 components.
Component 1
Name:
Adenosine receptor A2b
Synonyms:
AA2BR_RAT Adora2b
Type:
PROTEIN
Mol. Mass.:
36378.84
Organism:
Rattus norvegicus
Description:
ChEMBL_32934
Residue:
332
  
Component 2
Name:
Adenosine receptor A2a
Synonyms:
AA2AR_RAT Adenosine A2 receptor Adenosine Receptors A2a (A2a) Adenosine receptors A2a Rat striatal adenosine A2a receptor
Type:
G Protein-Coupled Receptor (GPCR)
Mol. Mass.:
45015.65
Organism:
Rattus norvegicus (rat)
Description:
Rat A2A receptors expressed in CHO cells.
Residue:
410
  
Inhibitor
Name:
BDBM50011844
Synonyms:
4-(1-Methyl-2,6-dioxo-3-propyl-2,3,6,7-tetrahydro-1H-purin-8-yl)-benzonitrile | CHEMBL33611
Type:
Small organic molecule
Emp. Form.:
C16H15N5O2
Mol. Mass.:
309.3226
SMILES:
CCCn1c2nc([nH]c2c(=O)n(C)c1=O)-c1ccc(cc1)C#N
: