Target
Neuronal acetylcholine receptor subunit beta-2/beta-4
Ligand
BDBM50270367
Substrate
Meas. Tech.
ChEMBL_1708058 (CHEMBL4059291)
IC50
30000±n/a nM
Citation
 Crestey, FJensen, AASoerensen, CMagnus, CBAndreasen, JTPeters, GHJKristensen, JL Dual Nicotinic Acetylcholine Receptor ?4?2 Antagonists/?7 Agonists: Synthesis, Docking Studies, and Pharmacological Evaluation of Tetrahydroisoquinolines and Tetrahydroisoquinolinium Salts. J Med Chem 61:1719-1729 (2018)  
Target
Name:
Neuronal acetylcholine receptor subunit beta-2/beta-4
Synonyms:
Nicotinic acetylcholine receptor alpha-4/beta-2
Type:
Mol. Mass.:
Description:
ASSAY_ID of ChEMBL is 1335312
Components:
This complex has 2 components.
Component 1
Name:
Neuronal acetylcholine receptor subunit beta-4
Synonyms:
ACHB4_MOUSE Chrnb4
Type:
PROTEIN
Mol. Mass.:
55814.93
Organism:
Mus musculus
Description:
ChEMBL_108396
Residue:
495
  
Component 2
Name:
Neuronal acetylcholine receptor subunit beta-2
Synonyms:
ACHB2_MOUSE | Chrnb2
Type:
PROTEIN
Mol. Mass.:
57114.19
Organism:
Mus musculus
Description:
ChEMBL_108396
Residue:
501
  
Inhibitor
Name:
BDBM50270367
Synonyms:
CHEMBL4067385
Type:
Small organic molecule
Emp. Form.:
C14H20INO
Mol. Mass.:
345.2192
SMILES:
[I-].COc1ccc2C3CCC[N+]3(C)CCc2c1
: