Target
Beta-secretase 1
Ligand
BDBM50270768
Substrate
Meas. Tech.
ChEMBL_1709543 (CHEMBL4119592)
Kd
169±n/a nM
Citation
 Yan, GHao, LNiu, YHuang, WWang, WXu, FLiang, LWang, CJin, HXu, P 2-Substituted-thio-N-(4-substituted-thiazol/1H-imidazol-2-yl)acetamides as BACE1 inhibitors: Synthesis, biological evaluation and docking studies. Eur J Med Chem 137:462-475 (2017)  
Target
Name:
Beta-secretase 1
Synonyms:
ASP2 Aspartyl protease 2 BACE1 Beta-secretase (BACE) Beta-secretase 1 (BACE 1) Beta-secretase 1 (BACE1) Beta-site amyloid precursor protein cleaving enzyme 1 Memapsin-2 beta-Secretase (BACE-1) | beta-Secretase (BACE1)
Type:
Protein
Mol. Mass.:
55755.10
Organism:
Homo sapiens (Human)
Description:
P56817
Residue:
501
  
Inhibitor
Name:
BDBM50270768
Synonyms:
CHEMBL4128447
Type:
Small organic molecule
Emp. Form.:
C23H17Cl2N7O3S
Mol. Mass.:
542.397
SMILES:
COc1cccc(c1)-c1nc(SCC(=O)Nc2nc(c[nH]2)-c2cc(Cl)c(N)c(Cl)c2)[nH]c(=O)c1C#N
: