Target
Toxopain-2
Ligand
BDBM50271684
Substrate
Meas. Tech.
ChEMBL_1711555 (CHEMBL4121604)
IC50
9800±n/a nM
Citation
 Zwicker, JDDiaz, NAGuerra, AJKirchhoff, PDWen, BSun, DCarruthers, VBLarsen, SD Optimization of dipeptidic inhibitors of cathepsin L for improved Toxoplasma gondii selectivity and CNS permeability. Bioorg Med Chem Lett 28:1972-1980 (2018)  
Target
Name:
Toxopain-2
Synonyms:
CPL Toxopain-2
Type:
PROTEIN
Mol. Mass.:
47549.50
Organism:
Toxoplasma gondii
Description:
ChEMBL_118107
Residue:
422
  
Inhibitor
Name:
BDBM50271684
Synonyms:
CHEMBL4130234
Type:
Small organic molecule
Emp. Form.:
C15H16FN3O2
Mol. Mass.:
289.3048
SMILES:
Fc1ccc(cc1)C(=O)N[C@@H](CC1CC1)C(=O)NCC#N
: