Target
Toxopain-2
Ligand
BDBM50271695
Substrate
Meas. Tech.
ChEMBL_1711555 (CHEMBL4121604)
IC50
4600±n/a nM
Citation
 Zwicker, JDDiaz, NAGuerra, AJKirchhoff, PDWen, BSun, DCarruthers, VBLarsen, SD Optimization of dipeptidic inhibitors of cathepsin L for improved Toxoplasma gondii selectivity and CNS permeability. Bioorg Med Chem Lett 28:1972-1980 (2018)  
Target
Name:
Toxopain-2
Synonyms:
CPL Toxopain-2
Type:
PROTEIN
Mol. Mass.:
47549.50
Organism:
Toxoplasma gondii
Description:
ChEMBL_118107
Residue:
422
  
Inhibitor
Name:
BDBM50271695
Synonyms:
CHEMBL4127142
Type:
Small organic molecule
Emp. Form.:
C23H27N3O3
Mol. Mass.:
393.4788
SMILES:
COc1cccc(C[C@H](NC(=O)c2cccc(c2)C(C)(C)C)C(=O)NCC#N)c1
: