Target
Toxopain-2
Ligand
BDBM50271685
Substrate
Meas. Tech.
ChEMBL_1711555 (CHEMBL4121604)
IC50
160±n/a nM
Citation
 Zwicker, JDDiaz, NAGuerra, AJKirchhoff, PDWen, BSun, DCarruthers, VBLarsen, SD Optimization of dipeptidic inhibitors of cathepsin L for improved Toxoplasma gondii selectivity and CNS permeability. Bioorg Med Chem Lett 28:1972-1980 (2018)  
Target
Name:
Toxopain-2
Synonyms:
CPL Toxopain-2
Type:
PROTEIN
Mol. Mass.:
47549.50
Organism:
Toxoplasma gondii
Description:
ChEMBL_118107
Residue:
422
  
Inhibitor
Name:
BDBM50271685
Synonyms:
CHEMBL4128887
Type:
Small organic molecule
Emp. Form.:
C18H21F4N3O
Mol. Mass.:
371.3725
SMILES:
CC(C)C[C@H](N[C@@H](c1ccc(F)cc1)C(F)(F)F)C(=O)NC1(CC1)C#N
: