Target
Protein mono-ADP-ribosyltransferase PARP10
Ligand
BDBM50272950
Substrate
Meas. Tech.
ChEMBL_1712748 (CHEMBL4122797)
IC50
468±n/a nM
Citation
 Holechek, JLease, RThorsell, AGKarlberg, TMcCadden, CGrant, RKeen, ACallahan, ESchüler, HFerraris, D Design, synthesis and evaluation of potent and selective inhibitors of mono-(ADP-ribosyl)transferases PARP10 and PARP14. Bioorg Med Chem Lett 28:2050-2054 (2018)  
Target
Name:
Protein mono-ADP-ribosyltransferase PARP10
Synonyms:
2.4.2.- ADP-ribosyltransferase diphtheria toxin-like 10 Human diphtheria toxin-like ADP-ribosyltransferase (ARTD10 or PARP10, L926Y)) Human diphtheria toxin-like ADP-ribosyltransferase (ARTD10 or PARP10, S927A)) PARP-10 Poly [ADP-ribose] polymerase 10
Type:
Mol. Mass.:
109953.63
Organism:
Homo sapiens (Human)
Description:
Q53GL7
Residue:
1025
  
Inhibitor
Name:
BDBM50272950
Synonyms:
CHEMBL4130035
Type:
Small organic molecule
Emp. Form.:
C24H22FN3O3
Mol. Mass.:
419.4482
SMILES:
NC(=O)c1ccc(Oc2cccc(c2)C(=O)N2CCN(CC2)c2cccc(F)c2)cc1
: