Target
Protein mono-ADP-ribosyltransferase PARP10
Ligand
BDBM50272966
Substrate
Meas. Tech.
ChEMBL_1712748 (CHEMBL4122797)
IC50
400±n/a nM
Citation
 Holechek, JLease, RThorsell, AGKarlberg, TMcCadden, CGrant, RKeen, ACallahan, ESchüler, HFerraris, D Design, synthesis and evaluation of potent and selective inhibitors of mono-(ADP-ribosyl)transferases PARP10 and PARP14. Bioorg Med Chem Lett 28:2050-2054 (2018)  
Target
Name:
Protein mono-ADP-ribosyltransferase PARP10
Synonyms:
2.4.2.- ADP-ribosyltransferase diphtheria toxin-like 10 Human diphtheria toxin-like ADP-ribosyltransferase (ARTD10 or PARP10, L926Y)) Human diphtheria toxin-like ADP-ribosyltransferase (ARTD10 or PARP10, S927A)) PARP-10 Poly [ADP-ribose] polymerase 10
Type:
Mol. Mass.:
109953.63
Organism:
Homo sapiens (Human)
Description:
Q53GL7
Residue:
1025
  
Inhibitor
Name:
BDBM50272966
Synonyms:
CHEMBL4129789
Type:
Small organic molecule
Emp. Form.:
C25H23FN2O3
Mol. Mass.:
418.4601
SMILES:
NC(=O)c1ccc(Oc2cccc(c2)C(=O)N2CCC(CC2)c2ccc(F)cc2)cc1
: