Target
Poly [ADP-ribose] polymerase 1
Ligand
BDBM50276749
Substrate
Meas. Tech.
ChEBML_1716013
IC50
0.500000±n/a nM
Citation
 Chen, WGuo, NQi, MDai, HHong, MGuan, LHuan, XSong, SHe, JWang, YXi, YYang, XShen, YSu, YSun, YGao, YChen, YDing, JTang, YRen, GMiao, ZLi, J Discovery, mechanism and metabolism studies of 2,3-difluorophenyl-linker-containing PARP1 inhibitors with enhanced in vivo efficacy for cancer therapy. Eur J Med Chem 138:514-531 (2017)  
Target
Name:
Poly [ADP-ribose] polymerase 1
Synonyms:
(ARTD1 or PARP1) 2.4.2.30 ADPRT ARTD1 Human diphtheria toxin-like ADP-ribosyltransferase (ARTD1 or PARP1) NT-PARP-1 PARP1 PPOL Poly [ADP-ribose] polymerase 1 (PARP) Poly [ADP-ribose] polymerase 1 (PARP1) Poly [ADP-ribose] polymerase 1, 28-kDa form Poly [ADP-ribose] polymerase 1, processed C-terminus Poly [ADP-ribose] polymerase-1 Poly(ADP-ribose) polymerase-1 (ARTD1/PARP1) Protein poly-ADP-ribosyltransferase PARP1 | Synonyms=ADPRT
Type:
Mol. Mass.:
113114.22
Organism:
Homo sapiens (Human)
Description:
P09874
Residue:
1014
  
Inhibitor
Name:
BDBM50276749
Synonyms:
CHEMBL4161414
Type:
Small organic molecule
Emp. Form.:
C26H22F2N4O2
Mol. Mass.:
460.4753
SMILES:
Fc1cc(Cc2n[nH]c(=O)c3ccccc23)cc(C(=O)N2CCN(CC2)c2ccccc2)c1F
: