Target
Free fatty acid receptor 4
Ligand
BDBM50278670
Substrate
Meas. Tech.
ChEMBL_1719140 (CHEMBL4134140)
EC50
25±n/a nM
Citation
 Zhang, XCai, CSui, ZMacielag, MWang, YYan, WSuckow, AHua, HBell, AHaug, PClapper, WJenkinson, CGunnet, JLeonard, JMurray, WV Discovery of an Isothiazole-Based Phenylpropanoic Acid GPR120 Agonist as a Development Candidate for Type 2 Diabetes. ACS Med Chem Lett 8:947-952 (2017)  
Target
Name:
Free fatty acid receptor 4
Synonyms:
FFAR4 G-protein coupled receptor 120 G-protein coupled receptor GT01 GPR120 O3FAR1 PGR4
Type:
PROTEIN
Mol. Mass.:
42256.91
Organism:
Homo sapiens (Human)
Description:
ChEMBL_1508994
Residue:
377
  
Inhibitor
Name:
BDBM50278670
Synonyms:
CHEMBL4171724
Type:
Small organic molecule
Emp. Form.:
C20H12ClF6NO3S
Mol. Mass.:
495.823
SMILES:
OC(=O)CCc1cc(F)c(OCc2c(nsc2C(F)(F)F)-c2ccc(Cl)c(F)c2)c(F)c1
: