Target
Translocator protein
Ligand
BDBM22032
Substrate
Meas. Tech.
ChEMBL_1720335 (CHEMBL4135335)
Kd
11±n/a nM
Citation
 Kim, TSon, WSMorshed, MNLondhe, AMJung, SYPark, JHPark, WKLim, SMPark, KDCho, SJJeong, KSLee, JPae, AN Discovery of thienopyrrolotriazine derivatives to protect mitochondrial function against A?-induced neurotoxicity. Eur J Med Chem 141:240-256 (2017)  
Target
Name:
Translocator protein
Synonyms:
BZRP Mitochondrial benzodiazepine receptor PKBS Peripheral-type benzodiazepine receptor TSPO_HUMAN
Type:
Enzyme
Mol. Mass.:
18834.74
Organism:
Homo sapiens (Human)
Description:
P30536
Residue:
169
  
Inhibitor
Name:
BDBM22032
Synonyms:
1-(2-chlorophenyl)-N-methyl-N-(1-methylpropyl)isoquinoline-3-carboxamide N-(butan-2-yl)-1-(2-chlorophenyl)-N-methylisoquinoline-3-carboxamide PK-11195 RP 52028 | [3H]PK 11195
Type:
radiolabeled ligand
Emp. Form.:
C21H21ClN2O
Mol. Mass.:
352.857
SMILES:
CCC(C)N(C)C(=O)c1cc2ccccc2c(n1)-c1ccccc1Cl
: