Target
Protein kinase C delta type
Ligand
BDBM50099066
Substrate
Meas. Tech.
ChEMBL_1722146 (CHEMBL4137146)
EC50
290±n/a nM
Citation
 Ann, JCzikora, ASaini, ASZhou, XMitchell, GALewin, NEPeach, MLBlumberg, PMLee, J ?-Arylidene Diacylglycerol-Lactones (DAG-Lactones) as Selective Ras Guanine-Releasing Protein 3 (RasGRP3) Ligands. J Med Chem 61:6261-6276 (2018)  
Target
Name:
Protein kinase C delta type
Synonyms:
KPCD_HUMAN PKCD Protein Kinase C- delta nPKC-delta
Type:
Enzyme
Mol. Mass.:
77516.79
Organism:
Homo sapiens (Human)
Description:
The recombinant human PKC enzymes were produced using a baculovirus expression system in SF9 cells
Residue:
676
  
Inhibitor
Name:
BDBM50099066
Synonyms:
CHEMBL279115 | phorbol 13-acetate 12-myristate
Type:
Small organic molecule
Emp. Form.:
C36H56O8
Mol. Mass.:
616.825
SMILES:
CCCCCCCCCCCCCC(=O)O[C@@H]1[C@@H](C)[C@]2(O)[C@@H]3C=C(C)C(=O)[C@@]3(O)CC(CO)=C[C@H]2[C@@H]2C(C)(C)[C@]12OC(C)=O
: