Target
Histone deacetylase 1
Ligand
BDBM50283689
Substrate
Meas. Tech.
ChEMBL_1726225 (CHEMBL4141503)
IC50
5.3±n/a nM
Citation
 Zhang, YYan, JYao, TP Discovery of a fluorescent probe with HDAC6 selective inhibition. Eur J Med Chem 141:596-602 (2017)  
Target
Name:
Histone deacetylase 1
Synonyms:
Cereblon/Histone deacetylase 1 HDAC1 Histone deacetylase 1 (HDAC1) RPD3L1
Type:
Enzyme
Mol. Mass.:
55090.27
Organism:
Homo sapiens (Human)
Description:
Q13547
Residue:
482
  
Inhibitor
Name:
BDBM50283689
Synonyms:
CHEMBL4160632
Type:
Small organic molecule
Emp. Form.:
C22H25N3O5
Mol. Mass.:
411.451
SMILES:
ONC(=O)CCCCCN1C(=O)c2cccc3c(ccc(C1=O)c23)N1CCOCC1
: