Target
Alpha-1A adrenergic receptor
Ligand
BDBM86731
Substrate
Meas. Tech.
ChEMBL_1726507 (CHEMBL4141785)
IC50
0.740000±n/a nM
Citation
 Petty, AIdippily, NBobba, VGeldenhuys, WJZhong, BSu, BWang, B Design and synthesis of small molecule agonists of EphA2 receptor. Eur J Med Chem 143:1261-1276 (2018)  
Target
Name:
Alpha-1A adrenergic receptor
Synonyms:
ADA1A_RAT Adra1c Alpha-1A adrenoceptor Alpha-1C adrenergic receptor | adrenergic Alpha1A
Type:
Protein
Mol. Mass.:
51620.15
Organism:
Rattus norvegicus (Rat)
Description:
P43140
Residue:
466
  
Inhibitor
Name:
BDBM86731
Synonyms:
CAS_74191-85-8 UK 33,274
Type:
Small organic molecule
Emp. Form.:
C23H25N5O5
Mol. Mass.:
451.4751
SMILES:
COc1cc2nc(nc(N)c2cc1OC)N1CCN(CC1)C(=O)C1COc2ccccc2O1
: