Target
Sodium/glucose cotransporter 1
Ligand
BDBM50285390
Substrate
Meas. Tech.
ChEMBL_1728110 (CHEMBL4143388)
EC50
3576±n/a nM
Citation
 Yuan, MCYeh, TKChen, CTSong, JSHuang, YCHsieh, TCHuang, CYHuang, YLWang, MHWu, SHYao, CHChao, YSLee, JC Identification of an oxime-containing C-glucosylarene as a potential inhibitor of sodium-dependent glucose co-transporter 2. Eur J Med Chem 143:611-620 (2018)  
Target
Name:
Sodium/glucose cotransporter 1
Synonyms:
High affinity sodium-glucose cotransporter Na(+)/glucose cotransporter 1 SGLT1 Sodium-dependent glucose cotransporter 1 (SGLT1) Sodium/glucose cotransporter 1 (SGLT1) | Solute carrier family 5 member 1
Type:
Protein
Mol. Mass.:
73503.78
Organism:
Homo sapiens (Human)
Description:
P13866
Residue:
664
  
Inhibitor
Name:
BDBM50285390
Synonyms:
CHEMBL4176765
Type:
Small organic molecule
Emp. Form.:
C21H24ClNO6
Mol. Mass.:
421.871
SMILES:
CCOc1ccc(Cc2cc(ccc2Cl)[C@@H]2O[C@H](\C=N\O)[C@@H](O)[C@H](O)[C@H]2O)cc1
: