Target
Cannabinoid receptor 2
Ligand
BDBM50286055
Substrate
Meas. Tech.
ChEMBL_1728850 (CHEMBL4144128)
EC50
59±n/a nM
Citation
 Han, SThoresen, LJung, JKZhu, XThatte, JSolomon, MGaidarov, IUnett, DJYoon, WHBarden, JSadeque, AUsmani, AChen, CSemple, GGrottick, AJAl-Shamma, HChristopher, RJones, RM Discovery of APD371: Identification of a Highly Potent and Selective CB ACS Med Chem Lett 8:1309-1313 (2017)  
Target
Name:
Cannabinoid receptor 2
Synonyms:
CANNABINOID CB2 CB2 CB2B CNR2_HUMAN Cannabinoid CB2 receptor Cannabinoid receptor 2 (CB2R) | hCB2
Type:
G Protein-Coupled Receptor (GPCR)
Mol. Mass.:
39690.94
Organism:
Homo sapiens (Human)
Description:
P34972
Residue:
360
  
Inhibitor
Name:
BDBM50286055
Synonyms:
CHEMBL4171474
Type:
Small organic molecule
Emp. Form.:
C18H23N5O2
Mol. Mass.:
341.4075
SMILES:
[H][C@@]12C[C@]1([H])c1c(C2)c(nn1-c1cnccn1)C(=O)N[C@H](CO)C(C)(C)C
: