Target
Cannabinoid receptor 1
Ligand
BDBM50286061
Substrate
Meas. Tech.
ChEMBL_1728855 (CHEMBL4144133)
EC50
2700±n/a nM
Citation
 Han, SThoresen, LJung, JKZhu, XThatte, JSolomon, MGaidarov, IUnett, DJYoon, WHBarden, JSadeque, AUsmani, AChen, CSemple, GGrottick, AJAl-Shamma, HChristopher, RJones, RM Discovery of APD371: Identification of a Highly Potent and Selective CB ACS Med Chem Lett 8:1309-1313 (2017)  
Target
Name:
Cannabinoid receptor 1
Synonyms:
Brain-type cannabinoid receptor CB-R CNR1_RAT Cannabinoid receptor Cnr1 | Skr6
Type:
G Protein-Coupled Receptor (GPCR)
Mol. Mass.:
52856.55
Organism:
Rattus norvegicus (rat)
Description:
P20272
Residue:
473
  
Inhibitor
Name:
BDBM50286061
Synonyms:
CHEMBL4166597
Type:
Small organic molecule
Emp. Form.:
C17H20FN5O2
Mol. Mass.:
345.3714
SMILES:
[H][C@@]12C[C@]1([H])c1c(C2)c(nn1-c1c[n+]([O-])ccn1)C(=O)N[C@H](CF)C(C)C
: