Target
Cannabinoid receptor 2
Ligand
BDBM50286065
Substrate
Meas. Tech.
ChEMBL_1728850 (CHEMBL4144128)
EC50
5.9±n/a nM
Citation
 Han, SThoresen, LJung, JKZhu, XThatte, JSolomon, MGaidarov, IUnett, DJYoon, WHBarden, JSadeque, AUsmani, AChen, CSemple, GGrottick, AJAl-Shamma, HChristopher, RJones, RM Discovery of APD371: Identification of a Highly Potent and Selective CB ACS Med Chem Lett 8:1309-1313 (2017)  
Target
Name:
Cannabinoid receptor 2
Synonyms:
CANNABINOID CB2 CB2 CB2B CNR2_HUMAN Cannabinoid CB2 receptor Cannabinoid receptor 2 (CB2R) | hCB2
Type:
G Protein-Coupled Receptor (GPCR)
Mol. Mass.:
39690.94
Organism:
Homo sapiens (Human)
Description:
P34972
Residue:
360
  
Inhibitor
Name:
BDBM50286065
Synonyms:
CHEMBL4175548
Type:
Small organic molecule
Emp. Form.:
C16H14F3N5O2
Mol. Mass.:
365.3099
SMILES:
[H][C@@]12C[C@]1([H])c1c(C2)c(nn1-c1c[n+]([O-])ccn1)C(=O)NC1(CC1)C(F)(F)F
: