Target
Cannabinoid receptor 1
Ligand
BDBM50286063
Substrate
Meas. Tech.
ChEMBL_1728852 (CHEMBL4144130)
EC50
>10000±n/a nM
Citation
 Han, SThoresen, LJung, JKZhu, XThatte, JSolomon, MGaidarov, IUnett, DJYoon, WHBarden, JSadeque, AUsmani, AChen, CSemple, GGrottick, AJAl-Shamma, HChristopher, RJones, RM Discovery of APD371: Identification of a Highly Potent and Selective CB ACS Med Chem Lett 8:1309-1313 (2017)  
Target
Name:
Cannabinoid receptor 1
Synonyms:
CANN6 CB-R CNR CNR1_HUMAN Cannabinoid receptor Cannabinoid receptor 1 (brain)
Type:
G Protein-Coupled Receptor (GPCR)
Mol. Mass.:
52868.96
Organism:
Homo sapiens (Human)
Description:
P21554
Residue:
472
  
Inhibitor
Name:
BDBM50286063
Synonyms:
CHEMBL4164688
Type:
Small organic molecule
Emp. Form.:
C15H14F3N5O3
Mol. Mass.:
369.2986
SMILES:
[H][C@@]12C[C@]1([H])c1c(C2)c(nn1-c1c[n+]([O-])ccn1)C(=O)N[C@@H](CO)C(F)(F)F
: