Target
Cannabinoid receptor 2
Ligand
BDBM50286066
Substrate
Meas. Tech.
ChEMBL_1728853 (CHEMBL4144131)
EC50
21±n/a nM
Citation
 Han, SThoresen, LJung, JKZhu, XThatte, JSolomon, MGaidarov, IUnett, DJYoon, WHBarden, JSadeque, AUsmani, AChen, CSemple, GGrottick, AJAl-Shamma, HChristopher, RJones, RM Discovery of APD371: Identification of a Highly Potent and Selective CB ACS Med Chem Lett 8:1309-1313 (2017)  
Target
Name:
Cannabinoid receptor 2
Synonyms:
CANNABINOID CB2 CB2 Cannabinoid CB2 receptor Cnr2 | rCB2
Type:
Enzyme
Mol. Mass.:
39366.68
Organism:
Rattus norvegicus (Rat)
Description:
Q9QZN9
Residue:
360
  
Inhibitor
Name:
BDBM50286066
Synonyms:
CHEMBL4162987
Type:
Small organic molecule
Emp. Form.:
C18H23N5O2
Mol. Mass.:
341.4075
SMILES:
[H][C@]12C[C@@]1([H])c1c(C2)c(nn1-c1cnccn1)C(=O)N[C@H](CO)C(C)(C)C
: