Target
Vasopressin V2 receptor
Ligand
BDBM50291824
Substrate
Meas. Tech.
ChEBML_215180
Ki
1±n/a nM
Citation
 Huffman, WFAlbrightson-Winslow, CBrickson, BBryan, HGCaldwell, NDytko, GEggleston, DSKinter, LBMoore, MLNewlander, KA A minor modification of residue 1 in potent vasopressin antagonists dramatically reduces agonist activity. J Med Chem 32:880-4 (1989)  
Target
Name:
Vasopressin V2 receptor
Synonyms:
ADHR AVPR2 DIR Renal-type arginine vasopressin receptor V2R_HUMAN Vasopressin V2 receptor | Vasopressin receptor
Type:
Receptor
Mol. Mass.:
40295.28
Organism:
Homo sapiens (Human)
Description:
P30518
Residue:
371
  
Inhibitor
Name:
BDBM50291824
Synonyms:
1-[19-Benzyl-13-carbamoylmethyl-22-(4-ethoxy-benzyl)-16-isopropyl-3-methyl-12,15,18,21,24-pentaoxo-7,8-dithia-11,14,17,20,23-pentaaza-spiro[5.19]pentacosane-10-carbonyl]-pyrrolidine-2-carboxylic acid (1-carbamoyl-4-guanidino-butyl)-amide | CHEMBL3084974
Type:
Small organic molecule
Emp. Form.:
C54H79N13O11S2
Mol. Mass.:
1150.416
SMILES:
CCOc1ccc(C[C@@H]2NC(=O)CC3(CCC(C)CC3)SSC[C@@H](NC(=O)[C@@H](CC(N)=O)NC(=O)[C@@H](NC(=O)[C@@H](Cc3ccccc3)NC2=O)C(C)C)C(=O)N2CCC[C@H]2C(=O)N[C@@H](CCCN=C(N)N)C(=O)NCC(N)=O)cc1
: