Target
Beta-2 adrenergic receptor
Ligand
BDBM50017396
Substrate
Meas. Tech.
ChEBML_37979
IC50
450±n/a nM
Citation
 Jamart-Gregoire, BCaubere, PBlanc, MGnassounou, JPAdvenier, C A new series of tricyclic (aryloximino)propanolamines displaying very high selective beta 2-blocking properties. J Med Chem 32:315-20 (1989)  
Target
Name:
Beta-2 adrenergic receptor
Synonyms:
ADRB2_CAVPO adrenergic Beta2
Type:
Enzyme Catalytic Domain
Mol. Mass.:
46993.24
Organism:
GUINEA PIG
Description:
adrenergic Beta2 ADRB2 GUINEA PIG::Q8K4Z4
Residue:
418
  
Inhibitor
Name:
BDBM50017396
Synonyms:
7-Fluoro-9a-methoxy-1,2,3,4,4a,9a-hexahydro-fluoren-9-one O-(3-tert-butylamino-2-hydroxy-propyl)-oxime | CHEMBL325371
Type:
Small organic molecule
Emp. Form.:
C21H31FN2O3
Mol. Mass.:
378.4808
SMILES:
COC12CCCCC1c1ccc(F)cc1\C2=N\OCC(O)CNC(C)(C)C
: