Target
Beta-1 adrenergic receptor
Ligand
BDBM50017383
Substrate
Meas. Tech.
ChEBML_39187
IC50
160±n/a nM
Citation
 Jamart-Gregoire, BCaubere, PBlanc, MGnassounou, JPAdvenier, C A new series of tricyclic (aryloximino)propanolamines displaying very high selective beta 2-blocking properties. J Med Chem 32:315-20 (1989)  
Target
Name:
Beta-1 adrenergic receptor
Synonyms:
ADRB1 adrenergic Beta1
Type:
Enzyme Catalytic Domain
Mol. Mass.:
50540.48
Organism:
GUINEA PIG
Description:
adrenergic Beta1 ADRB1 GUINEA PIG::B0FL73
Residue:
467
  
Inhibitor
Name:
BDBM50017383
Synonyms:
9a-Methoxy-5,6,7,8,9,9a-hexahydro-4bH-benzo[a]azulen-10-one O-(3-tert-butylamino-2-hydroxy-propyl)-oxime | CHEMBL107981
Type:
Small organic molecule
Emp. Form.:
C22H34N2O3
Mol. Mass.:
374.517
SMILES:
COC12CCCCCC1c1ccccc1\C2=N\OCC(O)CNC(C)(C)C
: