Target
Heme oxygenase 2
Ligand
BDBM50183062
Substrate
Meas. Tech.
ChEBML_1733253
IC50
>100000±n/a nM
Citation
 Salerno, LAmata, ERomeo, GMarrazzo, APrezzavento, OFloresta, GSorrenti, VBarbagallo, IRescifina, APittalą, V Potholing of the hydrophobic heme oxygenase-1 western region for the search of potent and selective imidazole-based inhibitors. Eur J Med Chem 148:54-62 (2018)  
Target
Name:
Heme oxygenase 2
Synonyms:
HMOX2_RAT Heme oxygenase 2 | Hmox2
Type:
Enzyme
Mol. Mass.:
35754.99
Organism:
Rattus norvegicus (rat)
Description:
HO-2 obtained from rat brain was used in enzyme assays.
Residue:
315
  
Inhibitor
Name:
BDBM50183062
Synonyms:
1-((2-(2-(4-chlorophenyl)ethyl)-1,3-dioxolan-2-yl)methyl)-1H-imidazole hydrochloride 2-[2-(4-chlorophenyl)ethyl]-2-[(1H-imidazol-1-yl)methyl]-1,3-dioxolane hydrochloride CHEMBL541899
Type:
Small organic molecule
Emp. Form.:
C15H17ClN2O2
Mol. Mass.:
292.761
SMILES:
Clc1ccc(CCC2(Cn3ccnc3)OCCO2)cc1
: