Target
Carbonic anhydrase 2
Ligand
BDBM50108105
Substrate
Meas. Tech.
ChEMBL_1735711 (CHEMBL4151247)
Ki
>20000±n/a nM
Citation
 Lomelino, CLMurray, ABSupuran, CTMcKenna, R Sweet Binders: Carbonic Anhydrase IX in Complex with Sucralose. ACS Med Chem Lett 9:657-661 (2018)  
Target
Name:
Carbonic anhydrase 2
Synonyms:
CA-II CAC Carbonate dehydratase II Carbonic anhydrase 2 (CA-II) Carbonic anhydrase C Carbonic anhydrase II (CA-II) Carbonic anhydrase II (hCA II) | Carbonic anhydrase isoenzyme II (hCA II)
Type:
Enzyme
Mol. Mass.:
29250.71
Organism:
Homo sapiens (Human)
Description:
P00918
Residue:
260
  
Inhibitor
Name:
BDBM50108105
Synonyms:
CHEBI:17992 | Sucrose
Type:
Small organic molecule
Emp. Form.:
C12H22O11
Mol. Mass.:
342.2965
SMILES:
OC[C@H]1O[C@@](CO)(O[C@H]2O[C@H](CO)[C@@H](O)[C@H](O)[C@H]2O)[C@@H](O)[C@@H]1O
: