Target
Pancreatic triacylglycerol lipase
Ligand
BDBM24567
Substrate
Meas. Tech.
ChEMBL_1735719 (CHEMBL4151255)
IC50
190±n/a nM
Citation
 Jalaja, RLeela, SGValmiki, PKSalfeena, CTFAshitha, KTKrishna Rao, VRDNair, MSGopalan, RKSomappa, SB Discovery of Natural Product Derived Labdane Appended Triazoles as Potent Pancreatic Lipase Inhibitors. ACS Med Chem Lett 9:662-666 (2018)  
Target
Name:
Pancreatic triacylglycerol lipase
Synonyms:
LIPP_HUMAN PNLIP | Pancreatic lipase
Type:
PROTEIN
Mol. Mass.:
51157.75
Organism:
Homo sapiens (Human)
Description:
ChEMBL_527250
Residue:
465
  
Inhibitor
Name:
BDBM24567
Synonyms:
(2S)-1-[(2S,3S)-3-hexyl-4-oxooxetan-2-yl]tridecan-2-yl (2S)-2-formamido-4-methylpentanoate Orlistat Tetrahydrolipstatin Xenical
Type:
Small organic molecule
Emp. Form.:
C29H53NO5
Mol. Mass.:
495.7348
SMILES:
CCCCCCCCCCC[C@@H](C[C@@H]1OC(=O)[C@H]1CCCCCC)OC(=O)[C@H](CC(C)C)NC=O
: