Target
Peroxisomal N(1)-acetyl-spermine/spermidine oxidase
Ligand
BDBM50405938
Substrate
Meas. Tech.
ChEBML_141590
Ki
800000±n/a nM
Citation
 Dredar, SABlankenship, JWMarchant, PEManneh, VFries, DS Design and synthesis of inhibitors of N8-acetylspermidine deacetylase. J Med Chem 32:984-9 (1989)  
Target
Name:
Peroxisomal N(1)-acetyl-spermine/spermidine oxidase
Synonyms:
Acetylpolyamine oxidase (APAO) PAOX Peroxisomal N(1)-acetyl-spermine/spermidine oxidase | Polyamine oxidase
Type:
Enzyme
Mol. Mass.:
70274.33
Organism:
Homo sapiens (Human)
Description:
Q6QHF9
Residue:
511
  
Inhibitor
Name:
BDBM50405938
Synonyms:
CHEMBL81241
Type:
Small organic molecule
Emp. Form.:
C6H14N2O
Mol. Mass.:
130.1882
SMILES:
CC(=O)NCCCCN
: