Target
Epithelial discoidin domain-containing receptor 1
Ligand
BDBM50368452
Substrate
Meas. Tech.
ChEMBL_1736075 (CHEMBL4151611)
Kd
7.9±n/a nM
Citation
 Wang, ZZhang, YPinkas, DMFox, AELuo, JHuang, HCui, SXiang, QXu, TXun, QZhu, DTu, ZRen, XBrekken, RABullock, ANLiang, GDing, KLu, X Design, Synthesis, and Biological Evaluation of 3-(Imidazo[1,2- a]pyrazin-3-ylethynyl)-4-isopropyl- N-(3-((4-methylpiperazin-1-yl)methyl)-5-(trifluoromethyl)phenyl)benzamide as a Dual Inhibitor of Discoidin Domain Receptors 1 and 2. J Med Chem 61:7977-7990 (2018)  
Target
Name:
Epithelial discoidin domain-containing receptor 1
Synonyms:
CAK DDR1_HUMAN Discoidin domain-containing receptor 1 (DDR1) EDDR1 Epithelial discoidin domain receptor 1 (DDR1) Epithelial discoidin domain-containing receptor 1 (DDR1) Mammary carcinoma kinase 10 NTRK4 Protein-tyrosine kinase RTK 6 TRKE | Tyrosine-protein kinase CAK
Type:
Tyrosine-protein kinase
Mol. Mass.:
101130.02
Organism:
Homo sapiens (Human)
Description:
Q08345
Residue:
913
  
Inhibitor
Name:
BDBM50368452
Synonyms:
CHEMBL4168305
Type:
Small organic molecule
Emp. Form.:
C31H31F3N6O
Mol. Mass.:
560.6126
SMILES:
CC(C)c1ccc(cc1C#Cc1cnc2cnccn12)C(=O)Nc1cc(CN2CCN(C)CC2)cc(c1)C(F)(F)F
: