Target
Vesicular acetylcholine transporter
Ligand
BDBM50018094
Substrate
Meas. Tech.
ChEBML_27660
IC50
20±n/a nM
Citation
 Rogers, GAParsons, SMAnderson, DCNilsson, LMBahr, BAKornreich, WDKaufman, RJacobs, RSKirtman, B Synthesis, in vitro acetylcholine-storage-blocking activities, and biological properties of derivatives and analogues of trans-2-(4-phenylpiperidino)cyclohexanol (vesamicol). J Med Chem 32:1217-30 (1989)  
Target
Name:
Vesicular acetylcholine transporter
Synonyms:
SLC18A3 VACHT | VACHT_HUMAN
Type:
PROTEIN
Mol. Mass.:
56900.67
Organism:
Homo sapiens (Human)
Description:
ChEMBL_1507628
Residue:
532
  
Inhibitor
Name:
BDBM50018094
Synonyms:
(1R,2R)-2-(4-Phenyl-piperidin-1-yl)-cyclohexanol 2-(4-Phenyl-piperidin-1-yl)-cyclohexanol(Vesamicol) Vesamicol | trans-2-(4-phenylpiperidin-1-yl)cyclohexanol
Type:
Small organic molecule
Emp. Form.:
C17H25NO
Mol. Mass.:
259.3865
SMILES:
O[C@@H]1CCCC[C@H]1N1CCC(CC1)c1ccccc1
: