Target
Adenomatous polyposis coli protein
Ligand
BDBM50369173
Substrate
Meas. Tech.
ChEMBL_1736427 (CHEMBL4151963)
Kd
5000±n/a nM
Citation
 Yang, XZhong, JZhang, QQian, JSong, KRuan, CXu, JDing, KZhang, J Rational Design and Structure Validation of a Novel Peptide Inhibitor of the Adenomatous-Polyposis-Coli (APC)-Rho-Guanine-Nucleotide-Exchange-Factor-4 (Asef) Interaction. J Med Chem 61:8017-8028 (2018)  
Target
Name:
Adenomatous polyposis coli protein
Synonyms:
APC DP2.5 Protein APC
Type:
Enzyme Catalytic Domain
Mol. Mass.:
311681.21
Organism:
Homo sapiens (Human)
Description:
Residue:
2843
  
Inhibitor
Name:
BDBM50369173
Synonyms:
CHEMBL4159448
Type:
Small organic molecule
Emp. Form.:
C42H51BrN8O15S
Mol. Mass.:
1019.868
SMILES:
C[C@H](NC(=O)OCc1ccccc1)C(=O)NCC(=O)N[C@@H](CCC(O)=O)C(=O)N[C@@H](CO)C(=O)N[C@@H](Cc1ccc(Br)s1)C(=O)N[C@@H](Cc1ccc(O)cc1)C(=O)N[C@@H](CCC(O)=O)C(N)=O
: