Target
Adenomatous polyposis coli protein
Ligand
BDBM50369191
Substrate
Meas. Tech.
ChEMBL_1736436 (CHEMBL4151972)
Kd
12±n/a nM
Citation
 Yang, XZhong, JZhang, QQian, JSong, KRuan, CXu, JDing, KZhang, J Rational Design and Structure Validation of a Novel Peptide Inhibitor of the Adenomatous-Polyposis-Coli (APC)-Rho-Guanine-Nucleotide-Exchange-Factor-4 (Asef) Interaction. J Med Chem 61:8017-8028 (2018)  
Target
Name:
Adenomatous polyposis coli protein
Synonyms:
APC DP2.5 Protein APC
Type:
Enzyme Catalytic Domain
Mol. Mass.:
311681.21
Organism:
Homo sapiens (Human)
Description:
Residue:
2843
  
Inhibitor
Name:
BDBM50369191
Synonyms:
CHEMBL4164672
Type:
Small organic molecule
Emp. Form.:
C41H56N8O15
Mol. Mass.:
900.9279
SMILES:
CC(C)C[C@H](NC(=O)[C@H](CO)NC(=O)[C@H](CCC(O)=O)NC(=O)CNC(=O)[C@H](C)NC(=O)OCc1ccccc1)C(=O)N[C@@H](Cc1ccc(O)cc1)C(=O)N[C@@H](CCC(O)=O)C(N)=O
: