Target
DNA gyrase subunit B
Ligand
BDBM50408204
Substrate
Meas. Tech.
ChEMBL_1739369 (CHEMBL4155119)
Ki
<0.050000±n/a nM
Citation
 Durcik, MLovison, DSkok, ?Durante Cruz, CTammela, PToma?i?, TBenedetto Tiz, DDraskovits, GNyerges, ÁPál, CIla?, JPeterlin Ma?i?, LKikelj, DZidar, N New N-phenylpyrrolamide DNA gyrase B inhibitors: Optimization of efficacy and antibacterial activity. Eur J Med Chem 154:117-132 (2018)  
Target
Name:
DNA gyrase subunit B
Synonyms:
DNA gyrase subunit B GYRB_ECOLI acrB gyrB hisU parA | pcbA
Type:
Enzyme Subunit
Mol. Mass.:
89941.28
Organism:
Escherichia coli (strain K12)
Description:
P0AES6
Residue:
804
  
Inhibitor
Name:
BDBM50408204
Synonyms:
CHEMBL4165664
Type:
Small organic molecule
Emp. Form.:
C22H23FN8O
Mol. Mass.:
434.4694
SMILES:
[H][C@]12CCN[C@@]1([H])CN(C2)c1nc(Oc2cnc(C)nc2)nc2[nH]c3c(NC)cc(F)cc3c12
: