Target
Relaxin receptor 1
Ligand
BDBM50449847
Substrate
Meas. Tech.
ChEMBL_1740775 (CHEMBL4156525)
EC50
3740±n/a nM
Citation
 Wilson, KJXiao, JChen, CZHuang, ZAgoulnik, IUFerrer, MSouthall, NHu, XZheng, WXu, XWang, AMyhr, CBarnaeva, EGeorge, ERAgoulnik, AIMarugan, JJ Optimization of the first small-molecule relaxin/insulin-like family peptide receptor (RXFP1) agonists: Activation results in an antifibrotic gene expression profile. Eur J Med Chem 156:79-92 (2018)  
Target
Name:
Relaxin receptor 1
Synonyms:
LGR7 RXFP1 Relaxin family peptide receptor 1
Type:
PROTEIN
Mol. Mass.:
86990.83
Organism:
Homo sapiens (Human)
Description:
ChEMBL_818426
Residue:
757
  
Inhibitor
Name:
BDBM50449847
Synonyms:
CHEMBL3715097
Type:
Small organic molecule
Emp. Form.:
C21H14ClF3N2O2
Mol. Mass.:
418.796
SMILES:
FC(F)(F)c1cccc(NC(=O)c2ccccc2NC(=O)c2ccccc2Cl)c1
: