Target
Baculoviral IAP repeat-containing protein 2
Ligand
BDBM50441356
Substrate
Meas. Tech.
ChEMBL_1741811 (CHEMBL4157561)
IC50
0.400000±n/a nM
Citation
 Johnson, CNAhn, JSBuck, IMChiarparin, EDay, JEHHopkins, AHoward, SLewis, EJMartins, VMillemaggi, AMunck, JMPage, LWPeakman, TReader, MRich, SJSaxty, GSmyth, TThompson, NTWard, GAWilliams, PAWilsher, NEChessari, G A Fragment-Derived Clinical Candidate for Antagonism of X-Linked and Cellular Inhibitor of Apoptosis Proteins: 1-(6-[(4-Fluorophenyl)methyl]-5-(hydroxymethyl)-3,3-dimethyl-1 H,2 H,3 H-pyrrolo[3,2- b]pyridin-1-yl)-2-[(2 R,5 R)-5-methyl-2-([(3R)-3-methylmorpholin-4-yl]methyl)piperazin-1-yl]ethan-1-one J Med Chem 61:7314-7329 (2018)  
Target
Name:
Baculoviral IAP repeat-containing protein 2
Synonyms:
API1 BIRC2_HUMAN Cellular inhibitor of apoptosis 1 MIHB | RNF48
Type:
Protein
Mol. Mass.:
69900.47
Organism:
Homo sapiens (Human)
Description:
Q13490
Residue:
618
  
Inhibitor
Name:
BDBM50441356
Synonyms:
CHEMBL2431768
Type:
Small organic molecule
Emp. Form.:
C26H33FN4O3S
Mol. Mass.:
500.629
SMILES:
CN[C@@H](C)C(=O)N[C@@H](C1CCCCC1)C(=O)N1CCC[C@H]1c1nc(cs1)C(=O)c1ccc(F)cc1
: