Target
Baculoviral IAP repeat-containing protein 2
Ligand
BDBM50450037
Substrate
Meas. Tech.
ChEMBL_1741811 (CHEMBL4157561)
IC50
0.200000±n/a nM
Citation
 Johnson, CNAhn, JSBuck, IMChiarparin, EDay, JEHHopkins, AHoward, SLewis, EJMartins, VMillemaggi, AMunck, JMPage, LWPeakman, TReader, MRich, SJSaxty, GSmyth, TThompson, NTWard, GAWilliams, PAWilsher, NEChessari, G A Fragment-Derived Clinical Candidate for Antagonism of X-Linked and Cellular Inhibitor of Apoptosis Proteins: 1-(6-[(4-Fluorophenyl)methyl]-5-(hydroxymethyl)-3,3-dimethyl-1 H,2 H,3 H-pyrrolo[3,2- b]pyridin-1-yl)-2-[(2 R,5 R)-5-methyl-2-([(3R)-3-methylmorpholin-4-yl]methyl)piperazin-1-yl]ethan-1-one J Med Chem 61:7314-7329 (2018)  
Target
Name:
Baculoviral IAP repeat-containing protein 2
Synonyms:
API1 BIRC2_HUMAN Cellular inhibitor of apoptosis 1 MIHB | RNF48
Type:
Protein
Mol. Mass.:
69900.47
Organism:
Homo sapiens (Human)
Description:
Q13490
Residue:
618
  
Inhibitor
Name:
BDBM50450037
Synonyms:
CHEMBL4164271
Type:
Small organic molecule
Emp. Form.:
C31H33F3N6O2
Mol. Mass.:
578.6279
SMILES:
C[C@@H]1CN(CC(=O)N2CC(C)(C)c3nnc(Cc4ccc(F)cc4F)cc23)[C@@H](CN2Cc3cc(F)ccc3C2=O)CN1
: