Target
Neuraminidase
Ligand
BDBM50451269
Substrate
Meas. Tech.
ChEMBL_1744757 (CHEMBL4179267)
Ki
580±n/a nM
Citation
 Enkhtaivan, GMuthuraman, PKim, DHMistry, B Discovery of berberine based derivatives as anti-influenza agent through blocking of neuraminidase. Bioorg Med Chem 25:5185-5193 (2017)  
Target
Name:
Neuraminidase
Synonyms:
Influenza A Virus Neuraminidase NRAM_I34A1 Neuraminidase A
Type:
Enzyme
Mol. Mass.:
50124.14
Organism:
Influenza A virus (A/Puerto Rico/8/34/Mount Sinai(H1N1))
Description:
P03468
Residue:
454
  
Inhibitor
Name:
BDBM50451269
Synonyms:
CHEMBL4213528
Type:
Small organic molecule
Emp. Form.:
C31H30ClN3O5
Mol. Mass.:
560.04
SMILES:
[Cl-].COc1cc(CN2CCN(CC2)C(=O)c2ccccc2)c2cc3-c4cc5OCOc5cc4CC[n+]3cc2c1O
: