Target
cGMP-dependent 3',5'-cyclic phosphodiesterase
Ligand
BDBM50452209
Substrate
Meas. Tech.
ChEMBL_1747200 (CHEMBL4181710)
Ki
4.3±n/a nM
Citation
 Forster, ABAbeywickrema, PBunda, JCox, CDCabalu, TDEgbertson, MFay, JGetty, KHall, DKornienko, MLu, JParthasarathy, GReid, JSharma, SShipe, WDSmith, SMSoisson, SStachel, SJSu, HPWang, DBerger, R The identification of a novel lead class for phosphodiesterase 2 inhibition by fragment-based drug design. Bioorg Med Chem Lett 27:5167-5171 (2017)  
Target
Name:
cGMP-dependent 3',5'-cyclic phosphodiesterase
Synonyms:
CGS-PDE Homo sapiens phosphodiesterase 2A (PDE2A) PDE2A cGSPDE
Type:
Enzyme Catalytic Domain
Mol. Mass.:
105691.58
Organism:
Homo sapiens (Human)
Description:
O00408
Residue:
941
  
Inhibitor
Name:
BDBM50452209
Synonyms:
CHEMBL4207777 | US10647727, Example 9
Type:
Small organic molecule
Emp. Form.:
C16H13ClF3N5
Mol. Mass.:
367.756
SMILES:
Cn1ncc2c(NC3(CC3)c3ccc(cc3)C(F)(F)F)nc(Cl)nc12
: