Target
DNA-(apurinic or apyrimidinic site) endonuclease
Ligand
BDBM81347
Substrate
Meas. Tech.
ChEMBL_1750393 (CHEMBL4185153)
IC50
500±n/a nM
Citation
 Laev, SSSalakhutdinov, NFLavrik, OI Inhibitors of nuclease and redox activity of apurinic/apyrimidinic endonuclease 1/redox effector factor 1 (APE1/Ref-1). Bioorg Med Chem 25:2531-2544 (2017)  
Target
Name:
DNA-(apurinic or apyrimidinic site) endonuclease
Synonyms:
APE APEX APEX1_HUMAN Apurinic-apyrimidinic endonuclease 1 (APE-1) DNA-(apurinic or apyrimidinic site) lyase REF1
Type:
Protein
Mol. Mass.:
35560.12
Organism:
Homo sapiens (Human)
Description:
P27695
Residue:
318
  
Inhibitor
Name:
BDBM81347
Synonyms:
L2037 (beta-lapachone)
Type:
Small organic molecule
Emp. Form.:
C7H8N2O3
Mol. Mass.:
168.15
SMILES:
CN(N=O)c1ccc(O)c(O)c1
: