Target
DNA-(apurinic or apyrimidinic site) endonuclease
Ligand
BDBM50579
Substrate
Meas. Tech.
ChEMBL_1750389 (CHEMBL4185149)
IC50
400±n/a nM
Citation
 Laev, SSSalakhutdinov, NFLavrik, OI Inhibitors of nuclease and redox activity of apurinic/apyrimidinic endonuclease 1/redox effector factor 1 (APE1/Ref-1). Bioorg Med Chem 25:2531-2544 (2017)  
Target
Name:
DNA-(apurinic or apyrimidinic site) endonuclease
Synonyms:
APE APEX APEX1_HUMAN Apurinic-apyrimidinic endonuclease 1 (APE-1) DNA-(apurinic or apyrimidinic site) lyase REF1
Type:
Protein
Mol. Mass.:
35560.12
Organism:
Homo sapiens (Human)
Description:
P27695
Residue:
318
  
Inhibitor
Name:
BDBM50579
Synonyms:
3,6,7-trimethoxyphenanthrene-2,5-diol SMR000440713 | cid_356768
Type:
Small organic molecule
Emp. Form.:
C17H16O5
Mol. Mass.:
300.3059
SMILES:
COc1cc2c(ccc3cc(OC)c(OC)c(O)c23)cc1O
: