Target
DNA-(apurinic or apyrimidinic site) endonuclease
Ligand
BDBM50431702
Substrate
Meas. Tech.
ChEMBL_1750387 (CHEMBL4185147)
IC50
1600±n/a nM
Citation
 Laev, SSSalakhutdinov, NFLavrik, OI Inhibitors of nuclease and redox activity of apurinic/apyrimidinic endonuclease 1/redox effector factor 1 (APE1/Ref-1). Bioorg Med Chem 25:2531-2544 (2017)  
Target
Name:
DNA-(apurinic or apyrimidinic site) endonuclease
Synonyms:
APE APEX APEX1_HUMAN Apurinic-apyrimidinic endonuclease 1 (APE-1) DNA-(apurinic or apyrimidinic site) lyase REF1
Type:
Protein
Mol. Mass.:
35560.12
Organism:
Homo sapiens (Human)
Description:
P27695
Residue:
318
  
Inhibitor
Name:
BDBM50431702
Synonyms:
CHEMBL2349528
Type:
Small organic molecule
Emp. Form.:
C13H11ClN2O2
Mol. Mass.:
262.692
SMILES:
Clc1cccc(NC(=O)c2noc3CCCc23)c1
: