Target
DNA-(apurinic or apyrimidinic site) endonuclease
Ligand
BDBM26616
Substrate
Meas. Tech.
ChEMBL_1750386 (CHEMBL4185146)
IC50
1400±n/a nM
Citation
 Laev, SSSalakhutdinov, NFLavrik, OI Inhibitors of nuclease and redox activity of apurinic/apyrimidinic endonuclease 1/redox effector factor 1 (APE1/Ref-1). Bioorg Med Chem 25:2531-2544 (2017)  
Target
Name:
DNA-(apurinic or apyrimidinic site) endonuclease
Synonyms:
APE APEX APEX1_HUMAN Apurinic-apyrimidinic endonuclease 1 (APE-1) DNA-(apurinic or apyrimidinic site) lyase REF1
Type:
Protein
Mol. Mass.:
35560.12
Organism:
Homo sapiens (Human)
Description:
P27695
Residue:
318
  
Inhibitor
Name:
BDBM26616
Synonyms:
2-aminobenzene-1,3,5-trisulfonamide | Compound 25857
Type:
Small organic molecule
Emp. Form.:
C6H10N4O6S3
Mol. Mass.:
330.362
SMILES:
Nc1c(cc(cc1S(N)(=O)=O)S(N)(=O)=O)S(N)(=O)=O
: