Target
DNA-(apurinic or apyrimidinic site) endonuclease
Ligand
BDBM4293
Substrate
Meas. Tech.
ChEMBL_1750393 (CHEMBL4185153)
IC50
280±n/a nM
Citation
 Laev, SSSalakhutdinov, NFLavrik, OI Inhibitors of nuclease and redox activity of apurinic/apyrimidinic endonuclease 1/redox effector factor 1 (APE1/Ref-1). Bioorg Med Chem 25:2531-2544 (2017)  
Target
Name:
DNA-(apurinic or apyrimidinic site) endonuclease
Synonyms:
APE APEX APEX1_HUMAN Apurinic-apyrimidinic endonuclease 1 (APE-1) DNA-(apurinic or apyrimidinic site) lyase REF1
Type:
Protein
Mol. Mass.:
35560.12
Organism:
Homo sapiens (Human)
Description:
P27695
Residue:
318
  
Inhibitor
Name:
BDBM4293
Synonyms:
(2E)-3-(3,4-dihydroxyphenyl)-2-[(3,4-dihydroxyphenyl)carbonyl]prop-2-enenitrile Tyrphostin deriv. 24 | cid_5328760
Type:
Small organic molecule
Emp. Form.:
C16H11NO5
Mol. Mass.:
297.2622
SMILES:
Oc1ccc(\C=C(/C#N)C(=O)c2ccc(O)c(O)c2)cc1O
: