Target
DNA-(apurinic or apyrimidinic site) endonuclease
Ligand
BDBM50453750
Substrate
Meas. Tech.
ChEMBL_1750384 (CHEMBL4185144)
IC50
900±n/a nM
Citation
 Laev, SSSalakhutdinov, NFLavrik, OI Inhibitors of nuclease and redox activity of apurinic/apyrimidinic endonuclease 1/redox effector factor 1 (APE1/Ref-1). Bioorg Med Chem 25:2531-2544 (2017)  
Target
Name:
DNA-(apurinic or apyrimidinic site) endonuclease
Synonyms:
APE APEX APEX1_HUMAN Apurinic-apyrimidinic endonuclease 1 (APE-1) DNA-(apurinic or apyrimidinic site) lyase REF1
Type:
Protein
Mol. Mass.:
35560.12
Organism:
Homo sapiens (Human)
Description:
P27695
Residue:
318
  
Inhibitor
Name:
BDBM50453750
Synonyms:
CHEMBL4203747
Type:
Small organic molecule
Emp. Form.:
C22H15Cl2FN2S
Mol. Mass.:
429.337
SMILES:
Cc1sc(Nc2cc(Cl)cc(Cl)c2)nc1-c1ccc(cc1)-c1ccccc1F
: