Target
DNA-(apurinic or apyrimidinic site) endonuclease
Ligand
BDBM50453751
Substrate
Meas. Tech.
ChEMBL_1750383 (CHEMBL4185143)
IC50
55±n/a nM
Citation
 Laev, SSSalakhutdinov, NFLavrik, OI Inhibitors of nuclease and redox activity of apurinic/apyrimidinic endonuclease 1/redox effector factor 1 (APE1/Ref-1). Bioorg Med Chem 25:2531-2544 (2017)  
Target
Name:
DNA-(apurinic or apyrimidinic site) endonuclease
Synonyms:
APE APEX APEX1_HUMAN Apurinic-apyrimidinic endonuclease 1 (APE-1) DNA-(apurinic or apyrimidinic site) lyase REF1
Type:
Protein
Mol. Mass.:
35560.12
Organism:
Homo sapiens (Human)
Description:
P27695
Residue:
318
  
Inhibitor
Name:
BDBM50453751
Synonyms:
CHEMBL4210534
Type:
Small organic molecule
Emp. Form.:
C32H40N4O2
Mol. Mass.:
512.6856
SMILES:
C1COCCNCc2ccc3ccc(CNCCOCCNCc4ccc5ccc(CN1)cc5c4)cc3c2
: